This is a platform for User Generated Content. G/O Media assumes no liability for content posted by Kinja users to this platform.

Clang++.exe error linker command failed with exit code 1 android


※ Download: Clang++.exe error linker command failed with exit code 1 android


















Apple iphone 501 ringtone download
Create exe in visual studio 2010
Descargar musica de christina aguilera contigo en la distancia

57068











clang: error: linker command failed with exit code 1 When building Go Focus on the first, not the last. Everything works, but when we used Xcode to post our work to Apple Connect we get the same error: linker command failed with exit code 1 use -v to see invocation clang The suggested solution didn’t work sadly. Thanks also for your understanding as we make these adjustments and improvements for the future. I’ll double check the project tomorrow for you. Turn that off maybe if its on in ios build settings on mac? It should call the assignment operator. Separate the words with spaces cat dog to search cat,dog or both.

Advertisement

linker command failed with exit code 1 If one gets a linker error, that means that compilation step has succeeded. Hopefully, you can help us as soon as possible —————————- System details Visual Studio Community 2017 for Mac Version 7. By the way you shouldn’t be including your source file. The compiler has not encountered objectionable syntax although code can be full of logical errors. Runs fine in Unity Editor as well.

clang: error: linker command failed with exit code 1 · Issue #1691 · react When you see an error, there can be multiple lines of it. What does your include file contain? Within compilation preprocessor prepares translation unit for the compiler. Pulling my hair out here! These can be combined with each other. Separate the words with plus signs cat +dog to search for items that may contain cat but must contain dog. Our sincere thanks to everyone who has contributed on this bug tracker over the years. Why does this class have an int pointer instead of just an int? If you do not know what is relevant, then assume that everything is.

Advertisement

Linker command failed with exit code 1 I tried the disabling of built-in ads extension and imported from the asset store instead, but this has made no difference. . Has anyone faced this issue before? Bugzilla will remain available for reference in read-only mode. I don’t know if you really need to remove the engine. Fixed: I removed unreal engine and set it up again from source. I’ve been away from my project for 2 months and upgraded to latest unity and xcode today Version 10.

Packaging to Android failed: linker command failed with exit code 1 We will continue to work on open Bugzilla bugs, copy them to the new locations as needed for follow-up, and add the new items under Related Links. Do you have any other suggestions? I also remember someone having issue which was due to symlinking when building initial project in unity? Please create a new report on or with your current version information, steps to reproduce, and relevant error messages or log files if you are hitting an issue that looks similar to this resolved bug and you do not yet see a matching new report. Please join us on and in the and organizations on GitHub to continue tracking issues. I didnt have movieplayer issue specifically, but it didnt like the multiple unity ads implementations when building in xcode. A build has multiple steps. . .

Advertisement

linker command failed with exit code 1 . . . . .

Linker command failed with exit code 1 . . . . . . .

Packaging to Android failed: linker command failed with exit code 1 . . . . . .

Advertisement

clang: error: linker command failed with exit code 1 · Issue #1691 · react . . . . .

57068











clang: error: linker command failed with exit code 1 When building Go

Focus on the first, not the last. Everything works, but when we used Xcode to post our work to Apple Connect we get the same error: linker command failed with exit code 1 use -v to see invocation clang The suggested solution didn’t work sadly. Thanks also for your understanding as we make these adjustments and improvements for the future. I’ll double check the project tomorrow for you. Turn that off maybe if its on in ios build settings on mac? It should call the assignment operator. Separate the words with spaces cat dog to search cat,dog or both.

Advertisement

linker command failed with exit code 1

If one gets a linker error, that means that compilation step has succeeded. Hopefully, you can help us as soon as possible —————————- System details Visual Studio Community 2017 for Mac Version 7. By the way you shouldn’t be including your source file. The compiler has not encountered objectionable syntax although code can be full of logical errors. Runs fine in Unity Editor as well.

Advertisement

clang: error: linker command failed with exit code 1 · Issue #1691 · react

When you see an error, there can be multiple lines of it. What does your include file contain? Within compilation preprocessor prepares translation unit for the compiler. Pulling my hair out here! These can be combined with each other. Separate the words with plus signs cat +dog to search for items that may contain cat but must contain dog. Our sincere thanks to everyone who has contributed on this bug tracker over the years. Why does this class have an int pointer instead of just an int? If you do not know what is relevant, then assume that everything is.

Advertisement

Linker command failed with exit code 1

I tried the disabling of built-in ads extension and imported from the asset store instead, but this has made no difference. . Has anyone faced this issue before? Bugzilla will remain available for reference in read-only mode. I don’t know if you really need to remove the engine. Fixed: I removed unreal engine and set it up again from source. I’ve been away from my project for 2 months and upgraded to latest unity and xcode today Version 10.

Advertisement

Packaging to Android failed: linker command failed with exit code 1

We will continue to work on open Bugzilla bugs, copy them to the new locations as needed for follow-up, and add the new items under Related Links. Do you have any other suggestions? I also remember someone having issue which was due to symlinking when building initial project in unity? Please create a new report on or with your current version information, steps to reproduce, and relevant error messages or log files if you are hitting an issue that looks similar to this resolved bug and you do not yet see a matching new report. Please join us on and in the and organizations on GitHub to continue tracking issues. I didnt have movieplayer issue specifically, but it didnt like the multiple unity ads implementations when building in xcode. A build has multiple steps. . .

Advertisement

linker command failed with exit code 1

. . . . .

Linker command failed with exit code 1

. . . . . . .

Packaging to Android failed: linker command failed with exit code 1

. . . . . .

clang: error: linker command failed with exit code 1 · Issue #1691 · react

. . . . .

Share This Story

Get our newsletter